{"text_format":"3","workbook":"xlsx","n_sheets":10,"sheets":["School+Head","DATA ENTRY","budget proposal","PR","RFQ","PO","abstract of canvass","IAR","RIS","ICS"],"not_rendered":{"images":4,"macros":1,"defined_names":6},"read":"whole","date_system":"1900"}

{"sheet":"School+Head","index":0,"n_rows":79,"n_cols":4,"rows_kept":79}
["Name of School","School Head","Designation","District"]
["AMIAN Elementary School","MARY NOVE JOY PERSEVERANCIA","Teacher-In-Charge","II"]
["BADIANGAY Elementary School","BABY JANE CULASINO","Principal I","V"]
["BALAGTINGON Elementary School","ERPIE PALLASAN","Teacher-In-Charge","II"]
["BALISONG Elementary School","JOEL ABARRO","Principal I","II"]
["BALLO Elementary School ","JOEMAR VILLAFUERTE","Teacher-In-Charge","V"]
["BANMAN Elementary School","BEN G. VILLAREÑA","Principal I","IV"]
["BANTAYAN Elementary School","VICENTE BIANAN","Principal I","IV"]
["BARAS DIUTAY Elementary School","JIM GUALINCO","Teacher-In-Charge","IV"]
["BARAS-DIUTAY EXT.","LEA ANTONIEGO","Principal I","IV"]
["BASAK Elementary School","EDUARDO AMBAHAN","Principal I","I"]
["BINICUIL Elementary School","DEVIN T. HUBAC","Principal I","III"]
["BINO Elementary School","MA. GINA CORDERO","Head Teacher I","I"]
["BUGTONG Elementary School","ARCHY MAR AGUILAR","Teacher-In-Charge","I"]
["BULA Elementary School","PATRIC ESPAÑOLA","Teacher-In-Charge","V"]
["CALABASAHAN Elementary School","CHRISTINE D. CALIGNER","Head Teacher III","III"]
["CAMANDAAN Elementary School","WENCESLAO PINEDA JR.","Teacher-In-Charge","IV"]
["CAMANSI Elementary School","RAUL MAMBALOS","Principal I","II"]
["CAMINGAWAN Elementary School","MA. LENITA CUIZON","Principal I","V"]
["CAMUGAO Elementary School","LODEVICO CALTRAVA","Head Teacher III","II"]
{"$rows_left_out":60}
{"sheet":"DATA ENTRY","index":1,"n_rows":16,"n_cols":6,"rows_kept":16,"merged":[[0,0,0,1]]}
["DATA ENTRY",null,"Description","Unit","Quantity","Unit \nCost"]
["School","DAAN BANUA National High School","Bond Paper, A4, subs 20","ream",1,{"v":15,"d":"15.00"}]
["District",{"$f":"VLOOKUP(B2,'School+Head'!A2:D79,4,FALSE)","v":"III"},"Bond Paper, Letter, subs 20","box",1,{"v":16,"d":"16.00"}]
["School Head",{"$f":"VLOOKUP(B2,'School+Head'!A2:D79,2,FALSE)","v":"DONNA BANAGLORIOSO"},"Bond Paper, Legal, subs 20","ream",2,{"v":17,"d":"17.00"}]
["Designation",{"$f":"VLOOKUP(B2,'School+Head'!A2:D79,3,FALSE)","v":"Principal I"},"Bond Paper, Legal, subs 20","pcs",3,18.35]
["Property Custodian",null,"Bond Paper, Legal, subs 20","pcs",4,{"v":19,"d":"19.00"}]
["BAC Member1",null,"Bond Paper, Legal, subs 20","pcs",5,{"v":20,"d":"20.00"}]
["BAC Member2",null,"Desktop Printer, A4, Continous Ink","pcs",6,{"v":21,"d":"21.00"}]
["BAC Member3",null,0,"pcs",78,{"v":22,"d":"22.00"}]
["BAC Member4",null,0,"pcs",78,{"v":22,"d":"22.00"}]
["BAC Member5",null,0,"pcs",78,{"v":22,"d":"22.00"}]
["Purpose","Office Supplies",0,"pcs",78,{"v":22,"d":"22.00"}]
[null,null,0,"pcs",78,{"v":22,"d":"22.00"}]
[null,null,0,"pcs",78,{"v":22,"d":"22.00"}]
[null,null,0,"pcs",78,{"v":22,"d":"22.00"}]
[null,null,0,"pcs",78,{"v":22,"d":"22.00"}]

{"sheet":"budget proposal","index":2,"n_rows":35,"n_cols":6,"rows_kept":35,"merged":[[0,0,0,5],[1,0,1,5],[2,0,2,5],[3,0,3,5],[4,0,4,5],[5,0,5,5],[6,0,6,5],[8,0,8,5],[9,0,9,5]]}
["Republic of the Philippines"]
["Department of Education"]
["Region VI - Western Visayas"]
["SCHOOLS DIVISION OFFICE of KABANKALAN CITY"]
[{"$f":"\"DISTRICT OF KABANKALAN \"&'DATA ENTRY'!B3","v":"DISTRICT OF KABANKALAN III"}]
[{"$f":"UPPER('DATA ENTRY'!B2)","v":"DAAN BANUA NATIONAL HIGH SCHOOL"}]
["City of Kabankalan"]
[]
["BUDGET PROPOSAL"]
["Date ______________________"]
[]
["Purpose: ",{"$f":"'DATA ENTRY'!B12","v":"Office Supplies"}]
[]
["No.","Description","Unit","Quantity","Unit \nCost","Amount"]
[1,{"$f":"'DATA ENTRY'!C2","v":"Bond Paper, A4, subs 20"},{"$f":"'DATA ENTRY'!D2","v":"ream"},{"$f":"'DATA ENTRY'!E2","v":1},{"$f":"'DATA ENTRY'!F2","v":{"v":15,"d":"15.00"}},{"$f":"D15*E15","v":{"v":15,"d":"15.00"}}]
[2,{"$f":"'DATA ENTRY'!C3","v":"Bond Paper, Letter, subs 20"},{"$f":"'DATA ENTRY'!D3","v":"box"},{"$f":"'DATA ENTRY'!E3","v":1},{"$f":"'DATA ENTRY'!F3","v":{"v":16,"d":"16.00"}},{"$f":"D16*E16","v":{"v":16,"d":"16.00"}}]
[3,{"$f":"'DATA ENTRY'!C4","v":"Bond Paper, Legal, subs 20"},{"$f":"'DATA ENTRY'!D4","v":"ream"},{"$f":"'DATA ENTRY'!E4","v":2},{"$f":"'DATA ENTRY'!F4","v":{"v":17,"d":"17.00"}},{"v":34,"d":"34.00"}]
[4,{"$f":"'DATA ENTRY'!C5","v":"Bond Paper, Legal, subs 20"},{"$f":"'DATA ENTRY'!D5","v":"pcs"},{"$f":"'DATA ENTRY'!E5","v":3},{"$f":"'DATA ENTRY'!F5","v":18.35},{"v":55.050000000000004,"d":"55.05"}]
[5,{"$f":"'DATA ENTRY'!C6","v":"Bond Paper, Legal, subs 20"},{"$f":"'DATA ENTRY'!D6","v":"pcs"},{"$f":"'DATA ENTRY'!E6","v":4},{"$f":"'DATA ENTRY'!F6","v":{"v":19,"d":"19.00"}},{"v":76,"d":"76.00"}]
[6,{"$f":"'DATA ENTRY'!C7","v":"Bond Paper, Legal, subs 20"},{"$f":"'DATA ENTRY'!D7","v":"pcs"},{"$f":"'DATA ENTRY'!E7","v":5},{"$f":"'DATA ENTRY'!F7","v":{"v":20,"d":"20.00"}},{"v":100,"d":"100.00"}]
{"$rows_left_out":16}
{"sheet":"PR","index":3,"n_rows":31,"n_cols":7,"rows_kept":31,"merged":[[0,0,0,7],[1,0,1,7],[2,0,2,7],[3,0,3,7],[4,0,4,7],[5,0,5,7],[6,0,6,7],[8,0,8,7],[10,0,10,1],[10,2,10,3],[11,0,12,1],[11,2,12,3],[13,0,14,0],[13,1,14,1],[13,2,14,2],[13,3,14,4],[13,5,14,5],[13,6,14,7],[15,3,15,4],[15,6,15,7],[16,3,16,4],[16,6,16,7],[17,3,17,4],[17,6,17,7],[18,3,18,4],[18,6,18,7],[19,3,19,4],[19,6,19,7],[20,3,20,4],[20,6,20,7],[21,3,21,4],[21,6,21,7],[22,3,22,4],[22,6,22,7],[23,3,23,4],[23,6,23,7],[24,3,24,4],[24,6,24,7],[25,0,25,5],[25,6,25,7],[26,0,26,1],[27,4,27,7],[28,0,28,1],[28,2,28,3],[28,4,28,7],[29,0,29,1],[29,2,29,3],[29,4,29,7],[30,0,30,1],[30,2,30,3],[30,4,30,7]]}
["Republic of the Philippines"]
["Department of Education"]
["Region VI - Western Visayas"]
["SCHOOLS DIVISION OFFICE of KABANKALAN CITY"]
[{"$f":"\"DISTRICT OF KABANKALAN \"&'DATA ENTRY'!B3","v":"DISTRICT OF KABANKALAN III"}]
[{"$f":"UPPER('DATA ENTRY'!B2)","v":"DAAN BANUA NATIONAL HIGH SCHOOL"}]
["City of Kabankalan"]
[]
["PURCHASE REQUEST"]
[]
["Department:",null,"DEPED",null,"PR No.",null,"Date:"]
["Section:",{"$nulls":3},"SAI No.",null,"Date:"]
[{"$nulls":4},"ALOBS No.",null,"Date:"]
["Item No.","Qty.","Unit of Issue","Item Description",null,"Estimated\nUnit Cost","Estimated\nCost"]
[]
[1,{"$f":"'DATA ENTRY'!E2","v":1},{"$f":"'DATA ENTRY'!D2","v":"ream"},{"$f":"'DATA ENTRY'!C2","v":"Bond Paper, A4, subs 20"},null,{"$f":"'DATA ENTRY'!F2","v":{"v":15,"d":"15.00"}},{"$f":"F16*B16","v":{"v":15,"d":"15.00"}}]
[2,{"$f":"'DATA ENTRY'!E3","v":1},{"$f":"'DATA ENTRY'!D3","v":"box"},{"$f":"'DATA ENTRY'!C3","v":"Bond Paper, Letter, subs 20"},null,{"$f":"'DATA ENTRY'!F3","v":{"v":16,"d":"16.00"}},{"$f":"F17*B17","v":{"v":16,"d":"16.00"}}]
[3,{"$f":"'DATA ENTRY'!E4","v":2},{"$f":"'DATA ENTRY'!D4","v":"ream"},{"$f":"'DATA ENTRY'!C4","v":"Bond Paper, Legal, subs 20"},null,{"$f":"'DATA ENTRY'!F4","v":{"v":17,"d":"17.00"}},{"v":34,"d":"34.00"}]
[4,{"$f":"'DATA ENTRY'!E5","v":3},{"$f":"'DATA ENTRY'!D5","v":"pcs"},{"$f":"'DATA ENTRY'!C5","v":"Bond Paper, Legal, subs 20"},null,{"$f":"'DATA ENTRY'!F5","v":18.35},{"v":55.050000000000004,"d":"55.05"}]
[5,{"$f":"'DATA ENTRY'!E6","v":4},{"$f":"'DATA ENTRY'!D6","v":"pcs"},{"$f":"'DATA ENTRY'!C6","v":"Bond Paper, Legal, subs 20"},null,{"$f":"'DATA ENTRY'!F6","v":{"v":19,"d":"19.00"}},{"v":76,"d":"76.00"}]
{"$rows_left_out":12}
{"sheet":"RFQ","index":4,"n_rows":60,"n_cols":5,"rows_kept":60,"merged":[[0,0,0,4],[1,0,1,4],[2,0,2,4],[3,0,3,4],[4,0,4,4],[5,0,5,4],[7,0,7,4],[38,3,38,4],[39,3,39,4],[47,0,48,4],[52,0,52,4],[54,0,54,1],[54,3,54,4],[55,0,55,1],[55,3,55,4],[58,0,58,1],[58,3,58,4],[59,0,59,1],[59,3,59,4]]}
["Republic of the Philippines"]
["Department of Education"]
["Region VI - Western Visayas"]
["SCHOOLS DIVISION OFFICE of KABANKALAN CITY"]
[{"$f":"\"DISTRICT OF KABANKALAN \"&'DATA ENTRY'!B3","v":"DISTRICT OF KABANKALAN III"}]
[{"$f":"UPPER('DATA ENTRY'!B2)","v":"DAAN BANUA NATIONAL HIGH SCHOOL"}]
[]
["REQUEST FOR QUOTATION"]
[]
[{"$nulls":3},"Date : _________________"]
[]
[]
[]
["Sir/Madam:"]
["               "]
["         Please quote your lowest price of the following items:"]
[]
["Quantity","Unit","Name / Description of Article","Unit Price","Total Price"]
[{"$f":"'DATA ENTRY'!E2","v":1},{"$f":"'DATA ENTRY'!D2","v":"ream"},{"$f":"'DATA ENTRY'!C2","v":"Bond Paper, A4, subs 20"},{"$f":"'DATA ENTRY'!F2","v":{"v":15,"d":"15.00"}},{"$f":"D19*A19","v":{"v":15,"d":"15.00"}}]
[{"$f":"'DATA ENTRY'!E3","v":1},{"$f":"'DATA ENTRY'!D3","v":"box"},{"$f":"'DATA ENTRY'!C3","v":"Bond Paper, Letter, subs 20"},{"$f":"'DATA ENTRY'!F3","v":{"v":16,"d":"16.00"}},{"$f":"D20*A20","v":{"v":16,"d":"16.00"}}]
{"$rows_left_out":41}
{"sheet":"PO","index":5,"n_rows":49,"n_cols":6,"rows_kept":49,"merged":[[0,4,0,5],[3,0,3,5],[4,0,4,5],[5,0,5,5],[7,1,7,2],[8,1,8,2],[8,3,8,5],[9,1,9,2],[9,3,9,5],[11,0,11,5],[13,3,13,5],[14,3,14,5],[32,0,32,4],[34,0,35,5],[37,0,37,1],[37,3,37,4],[42,0,42,2],[42,3,42,5],[43,0,43,2],[43,3,43,5],[47,0,47,2],[48,0,49,2]]}
[{"$nulls":4},"Appendix 61\n"]
[]
[]
["PURCHASE ORDER"]
[{"$f":"UPPER('DATA ENTRY'!B2)","v":"DAAN BANUA NATIONAL HIGH SCHOOL"}]
["Entity Name"]
[]
["Supplier : ",null,null,"P.O. No. : "]
["Address :    ",null,null,"Date : "]
["TIN : ",null,null,"Mode of Procurement : "]
[" Gentlemen:"]
["    Please furnish this Office the following articles subject to the terms and conditions contained herein:"]
[]
["Place of Delivery :  ",null,null,"Delivery Term : "]
["Date of Delivery : ",null,null,"Payment Term : "]
["Stock/ Property\nNo.","Unit","Description","Quantity","Unit Cost","Amount"]
[null,{"$f":"'DATA ENTRY'!D2","v":"ream"},{"$f":"'DATA ENTRY'!C2","v":"Bond Paper, A4, subs 20"},{"$f":"'DATA ENTRY'!E2","v":1},{"$f":"'DATA ENTRY'!F2","v":{"v":15,"d":"15.00"}},{"$f":"E17*D17","v":{"v":15,"d":"15.00"}}]
[null,{"$f":"'DATA ENTRY'!D3","v":"box"},{"$f":"'DATA ENTRY'!C3","v":"Bond Paper, Letter, subs 20"},{"$f":"'DATA ENTRY'!E3","v":1},{"$f":"'DATA ENTRY'!F3","v":{"v":16,"d":"16.00"}},{"$f":"E18*D18","v":{"v":16,"d":"16.00"}}]
[null,{"$f":"'DATA ENTRY'!D4","v":"ream"},{"$f":"'DATA ENTRY'!C4","v":"Bond Paper, Legal, subs 20"},{"$f":"'DATA ENTRY'!E4","v":2},{"$f":"'DATA ENTRY'!F4","v":{"v":17,"d":"17.00"}},{"$f":"E19*D19","v":{"v":34,"d":"34.00"}}]
[null,{"$f":"'DATA ENTRY'!D5","v":"pcs"},{"$f":"'DATA ENTRY'!C5","v":"Bond Paper, Legal, subs 20"},{"$f":"'DATA ENTRY'!E5","v":3},{"$f":"'DATA ENTRY'!F5","v":18.35},{"v":55.050000000000004,"d":"55.05"}]
{"$rows_left_out":30}
{"sheet":"abstract of canvass","index":6,"n_rows":33,"n_cols":9,"rows_kept":33,"merged":[[0,0,0,8],[1,0,1,8],[2,0,2,8],[3,0,3,8],[4,0,4,8],[5,0,5,8],[7,0,7,8],[8,7,8,8],[9,7,9,8],[10,3,10,5],[10,7,10,8],[12,0,14,0],[12,1,14,1],[12,2,14,2],[12,3,12,8],[13,3,13,4],[13,5,13,6],[13,7,13,8],[27,0,27,2],[29,0,29,8],[31,0,31,1],[31,2,31,5],[31,6,31,8],[32,0,32,1],[32,3,32,5],[32,6,32,8]]}
["Republic of the Philippines"]
["Department of Education"]
["Region VI - Western Visayas"]
["SCHOOLS DIVISION OFFICE of KABANKALAN CITY"]
[{"$f":"\"DISTRICT OF KABANKALAN \"&'DATA ENTRY'!B3","v":"DISTRICT OF KABANKALAN III"}]
[{"$f":"UPPER('DATA ENTRY'!B2)","v":"DAAN BANUA NATIONAL HIGH SCHOOL"}]
[]
["A B S T R A C T   O F   C A N V A S S"]
[{"$nulls":6},"Abstract No."]
[{"$nulls":6},"Date "]
["Division: City of Kabankalan",null,"Office: ",{"$nulls":3},"P.O."]
[]
["DESCRIPTION OF ITEM","QUANTITY","UNIT","N A M E   O F   S U P P L I E R S"]
[{"$nulls":3},"supplier 1",null,"supplier 2",null,"supplier 3"]
[{"$nulls":3},"Unit Price","Total Price","Unit Price","Total Price","Unit Price","Total Price"]
[{"$f":"'DATA ENTRY'!C2","v":"Bond Paper, A4, subs 20"},{"$f":"'DATA ENTRY'!E2","v":1},{"$f":"'DATA ENTRY'!D2","v":"ream"},null,{"$f":"D16*B16","v":0},null,{"$f":"B16*F16","v":0},null,{"$f":"H16*B16","v":0}]
[{"$f":"'DATA ENTRY'!C3","v":"Bond Paper, Letter, subs 20"},{"$f":"'DATA ENTRY'!E3","v":1},{"$f":"'DATA ENTRY'!D3","v":"box"},null,{"$f":"D17*B17","v":0},null,{"$f":"B17*F17","v":0},null,{"$f":"H17*B17","v":0}]
[{"$f":"'DATA ENTRY'!C4","v":"Bond Paper, Legal, subs 20"},{"$f":"'DATA ENTRY'!E4","v":2},{"$f":"'DATA ENTRY'!D4","v":"ream"},null,0,null,0,null,0]
[{"$f":"'DATA ENTRY'!C5","v":"Bond Paper, Legal, subs 20"},{"$f":"'DATA ENTRY'!E5","v":3},{"$f":"'DATA ENTRY'!D5","v":"pcs"},null,0,null,0,null,0]
[{"$f":"'DATA ENTRY'!C6","v":"Bond Paper, Legal, subs 20"},{"$f":"'DATA ENTRY'!E6","v":4},{"$f":"'DATA ENTRY'!D6","v":"pcs"},null,0,null,0,null,0]
{"$rows_left_out":14}
{"sheet":"IAR","index":7,"n_rows":36,"n_cols":6,"rows_kept":36,"merged":[[0,2,1,3],[0,4,0,6],[3,0,3,6],[4,0,4,6],[6,4,6,6],[8,2,8,3],[8,5,8,6],[9,2,9,3],[9,5,9,6],[10,2,10,3],[10,5,10,6],[11,2,11,3],[11,5,11,6],[13,1,13,3],[13,5,13,6],[14,1,14,3],[14,5,14,6],[15,1,15,3],[15,5,15,6],[16,1,16,3],[16,5,16,6],[17,1,17,3],[17,5,17,6],[18,1,18,3],[18,5,18,6],[19,1,19,3],[19,5,19,6],[20,1,20,3],[20,5,20,6],[21,1,21,3],[21,5,21,6],[22,1,22,3],[22,5,22,6],[23,0,23,2],[23,3,23,6],[24,0,25,2],[24,3,25,6],[26,0,28,2],[26,3,27,6],[28,3,29,6],[30,0,30,2],[30,3,30,6],[31,0,31,2],[31,3,31,6],[32,0,32,2],[33,0,33,2],[34,0,34,2],[34,3,34,6],[35,0,35,2],[35,3,35,6]]}
[{"$nulls":4},"Appendix 62"]
[]
[]
["INSPECTION AND ACCEPTANCE REPORT"]
[]
[]
["Entity Name : ______________________________",{"$nulls":3},"Fund Cluster : ___________"]
[]
[" Supplier : ",{"$nulls":3},"IAR No. : "]
[" PO No./Date : ",{"$nulls":3},"Date :"]
[" Requisitioning Office/Dept. : ",{"$nulls":3},"Invoice No. :"]
[" Responsibility Center Code : ",{"$nulls":3},"Date : "]
[]
["Stock/ \nProperty No.","Description",null,null,"Unit","Quantity"]
[null,{"$f":"'DATA ENTRY'!C2","v":"Bond Paper, A4, subs 20"},null,null,{"$f":"'DATA ENTRY'!D2","v":"ream"},{"$f":"'DATA ENTRY'!E2","v":1}]
[null,{"$f":"'DATA ENTRY'!C3","v":"Bond Paper, Letter, subs 20"},null,null,{"$f":"'DATA ENTRY'!D3","v":"box"},{"$f":"'DATA ENTRY'!E3","v":1}]
[null,{"$f":"'DATA ENTRY'!C4","v":"Bond Paper, Legal, subs 20"},null,null,{"$f":"'DATA ENTRY'!D4","v":"ream"},{"$f":"'DATA ENTRY'!E4","v":2}]
[null,{"$f":"'DATA ENTRY'!C5","v":"Bond Paper, Legal, subs 20"},null,null,{"$f":"'DATA ENTRY'!D5","v":"pcs"},{"$f":"'DATA ENTRY'!E5","v":3}]
[null,{"$f":"'DATA ENTRY'!C6","v":"Bond Paper, Legal, subs 20"},null,null,{"$f":"'DATA ENTRY'!D6","v":"pcs"},{"$f":"'DATA ENTRY'!E6","v":4}]
[null,{"$f":"'DATA ENTRY'!C7","v":"Bond Paper, Legal, subs 20"},null,null,{"$f":"'DATA ENTRY'!D7","v":"pcs"},{"$f":"'DATA ENTRY'!E7","v":5}]
{"$rows_left_out":17}
{"sheet":"RIS","index":8,"n_rows":31,"n_cols":8,"rows_kept":31,"merged":[[4,0,4,7],[6,1,6,5],[10,0,10,3],[10,4,10,5],[10,6,10,7],[24,1,24,7],[25,3,25,4],[25,5,25,6],[26,3,26,4],[26,5,26,6],[27,3,27,4],[27,5,27,6],[28,3,28,4],[28,5,28,6],[29,3,29,4],[29,5,29,6]]}
[]
[{"$nulls":7},"Appendix 63"]
[]
[]
["REQUISITION AND ISSUE SLIP "]
[]
["Entity Name : ",{"$f":"UPPER('DATA ENTRY'!B2)","v":"DAAN BANUA NATIONAL HIGH SCHOOL"},{"$nulls":4},"Fund Cluster : ______________________"]
[]
["Division : _______________________________________________",{"$nulls":4},"Responsibility Center Code : ______________________"]
["Office : ________________________________________________",{"$nulls":4},"RIS No. : _____________________________________"]
["Requisition",{"$nulls":3},"Stock Available?",null,"Issue"]
["Stock No.","Unit","Description","Quantity","Yes","No","Quantity","Remarks"]
[null,{"$f":"'DATA ENTRY'!D2","v":"ream"},{"$f":"'DATA ENTRY'!C2","v":"Bond Paper, A4, subs 20"},{"$f":"'DATA ENTRY'!E2","v":1},null,"P",{"$f":"'DATA ENTRY'!E2","v":1}]
[null,{"$f":"'DATA ENTRY'!D3","v":"box"},{"$f":"'DATA ENTRY'!C3","v":"Bond Paper, Letter, subs 20"},{"$f":"'DATA ENTRY'!E3","v":1},null,"P",{"$f":"'DATA ENTRY'!E3","v":1}]
[null,{"$f":"'DATA ENTRY'!D4","v":"ream"},{"$f":"'DATA ENTRY'!C4","v":"Bond Paper, Legal, subs 20"},{"$f":"'DATA ENTRY'!E4","v":2},null,"P",{"$f":"'DATA ENTRY'!E4","v":2}]
[null,{"$f":"'DATA ENTRY'!D5","v":"pcs"},{"$f":"'DATA ENTRY'!C5","v":"Bond Paper, Legal, subs 20"},{"$f":"'DATA ENTRY'!E5","v":3},null,"P",{"$f":"'DATA ENTRY'!E5","v":3}]
[null,{"$f":"'DATA ENTRY'!D6","v":"pcs"},{"$f":"'DATA ENTRY'!C6","v":"Bond Paper, Legal, subs 20"},{"$f":"'DATA ENTRY'!E6","v":4},null,"P",{"$f":"'DATA ENTRY'!E6","v":4}]
[null,{"$f":"'DATA ENTRY'!D7","v":"pcs"},{"$f":"'DATA ENTRY'!C7","v":"Bond Paper, Legal, subs 20"},{"$f":"'DATA ENTRY'!E7","v":5},null,"P",{"$f":"'DATA ENTRY'!E7","v":5}]
[null,{"$f":"'DATA ENTRY'!D8","v":"pcs"},{"$f":"'DATA ENTRY'!C8","v":"Desktop Printer, A4, Continous Ink"},{"$f":"'DATA ENTRY'!E8","v":6},null,"P",{"$f":"'DATA ENTRY'!E8","v":6}]
[null,{"$f":"'DATA ENTRY'!D9","v":"pcs"},{"$f":"'DATA ENTRY'!C9","v":0},{"$f":"'DATA ENTRY'!E9","v":78},null,"P",{"$f":"'DATA ENTRY'!E9","v":78}]
{"$rows_left_out":12}
{"sheet":"ICS","index":9,"n_rows":41,"n_cols":8,"rows_kept":41,"merged":[[0,6,0,7],[0,10,0,18],[1,0,1,7],[2,0,2,7],[3,0,3,7],[3,10,3,18],[4,0,4,7],[4,10,4,18],[5,0,5,7],[5,10,5,18],[7,0,7,7],[9,0,10,7],[9,10,9,18],[12,1,12,7],[15,0,17,0],[15,1,17,1],[15,2,15,3],[15,4,17,5],[15,6,17,6],[15,7,17,7],[16,2,17,2],[16,3,17,3],[18,4,18,5],[19,4,19,5],[20,4,20,5],[21,4,21,5],[22,4,22,5],[23,4,23,5],[24,4,24,5],[25,4,25,5],[26,4,26,5],[27,4,27,5],[28,4,28,5],[29,4,29,5],[30,0,30,3],[30,4,30,7],[31,0,31,3],[31,4,31,7],[32,0,32,3],[32,4,32,7],[33,0,33,3],[33,4,33,7],[34,0,34,3],[34,4,34,7],[35,0,35,3],[35,4,35,7],[36,0,36,3],[36,4,36,7],[39,4,39,7],[40,4,40,7],[98,0,98,7]]}
[{"$nulls":6},"Appendix 59"]
["Republic of the Philippines"]
["Department of Education"]
["Region VI - Western Visayas"]
["SCHOOLS DIVISION OFFICE of KABANKALAN CITY"]
[{"$f":"\"DISTRICT OF KABANKALAN \"&'DATA ENTRY'!B3","v":"DISTRICT OF KABANKALAN III"}]
[]
[{"$f":"UPPER('DATA ENTRY'!B2)","v":"DAAN BANUA NATIONAL HIGH SCHOOL"}]
[]
["INVENTORY CUSTODIAN  SLIP"]
[]
[]
["Entity Name: ",{"$f":"UPPER('DATA ENTRY'!B2)","v":"DAAN BANUA NATIONAL HIGH SCHOOL"}]
["Fund Cluster : ________________________________",{"$nulls":4},"ICS No : __________________________"]
[]
["Quantity","Unit","Amount",null,"Description",null,"Inventory Item No.","Estimated Useful Life"]
[null,null,"Unit\nCost","Total \nCost"]
[]
[{"$f":"'DATA ENTRY'!E2","v":1},{"$f":"'DATA ENTRY'!D2","v":"ream"},{"$f":"'DATA ENTRY'!F2","v":{"v":15,"d":"15.00"}},{"$f":"C19*A19","v":{"v":15,"d":"15.00"}},{"$f":"'DATA ENTRY'!C2","v":"Bond Paper, A4, subs 20"}]
[{"$f":"'DATA ENTRY'!E3","v":1},{"$f":"'DATA ENTRY'!D3","v":"box"},{"$f":"'DATA ENTRY'!F3","v":{"v":16,"d":"16.00"}},{"$f":"C20*A20","v":{"v":16,"d":"16.00"}},{"$f":"'DATA ENTRY'!C3","v":"Bond Paper, Letter, subs 20"}]
{"$rows_left_out":21}